[kde-linux] kdebase-runtime 4.1 compilation minor issue



Linux 2.6.26
gcc 4.3.1
KDE 4.1

Now the problem is with kdebase-runtime

[ 64%] Building CXX object phonon/platform_kde/CMakeFiles/kde.dir/kdepluginfactory.o
/home/fraga/src/kdebase-runtime-4.1.0/phonon/platform_kde/kdepluginfactory.cpp: In member function 'virtual QList<int> Phonon::KdePlatformPlugin::objectDescriptionIndexes(Phonon::ObjectDescriptionType) const':
/home/fraga/src/kdebase-runtime-4.1.0/phonon/platform_kde/kdepluginfactory.cpp:274: error: 'AudioCaptureDeviceType' was not declared in this scope
/home/fraga/src/kdebase-runtime-4.1.0/phonon/platform_kde/kdepluginfactory.cpp: In member function 'virtual QHash<QByteArray, QVariant> Phonon::KdePlatformPlugin::objectDescriptionProperties(Phonon::ObjectDescriptionType, int) const':
/home/fraga/src/kdebase-runtime-4.1.0/phonon/platform_kde/kdepluginfactory.cpp:286: error: 'AudioCaptureDeviceType' was not declared in this scope
make[2]: *** [phonon/platform_kde/CMakeFiles/kde.dir/kdepluginfactory.o] Error 1
make[1]: *** [phonon/platform_kde/CMakeFiles/kde.dir/all] Error 2
make: *** [all] Error 2

Any hint? Thank you.

--
Linux 2.6.26: Rotary Wombat
http://u-br.net


___________________________________________________
This message is from the kde-linux mailing list.
Account management: https://mail.kde.org/mailman/listinfo/kde-linux.
Archives: http://lists.kde.org/.
More info: http://www.kde.org/faq.html.