Matlab throwing errors about not finding libXp.so.6



On Thu, 13 May 2010, Bay E. Grabowski wrote:

/opt/MATLAB/bin/glnxa64/MATLAB: error while loading shared libraries: libXp.so.6: cannot open shared object file: No such file or directory

I am running the 64-bit version of RHEL and Matlab. I tried to install libXpm, but that did not solve the problem. Running "locate libXp" reveals that only libXpm.so.4 was available to the system. Can anyone help?

xorg-x11-deprecated-libs formerly hend libXp.so.6

note that libXpm != libXp -- the former deals with xpm pixmaps, the latter with print clients

http://www.x.org/archive/X11R6.8.1/doc/libXp.3.html

I'd check with your vendor on this --- a LSB confirmant package should not be asking for this any more

-- Russ herrold

--
redhat-list mailing list
unsubscribe mailto:redhat-list-request@xxxxxxxxxx?subject=unsubscribe
https://www.redhat.com/mailman/listinfo/redhat-list



Relevant Pages

  • Re: error running program: libXp.so.6 not found
    ... shared libraries: libXp.so.6: cannot open shared object file: No such ... ls libXp.* ...
    (comp.os.linux.misc)
  • [SLE] Problems after update
    ... "Update all package versions on your suse linux 10.0 machine" found on the Novell site. ... xauth: error while loading shared libraries: libXext.so.6: cannot open shared object file: No such file or directory ...
    (SuSE)
  • Re: cannot install Maple95 on FC5
    ... Extracting the installation resources from the installer archive... ... dirname: error while loading shared libraries: libc.so.6: cannot open shared object file: No such file or directory ...
    (Fedora)
  • CodeGear : Kylix patch ...
    ... sorry for posting here but the kylix groups are quite as dead as kylix itself :-( ... expr: error while loading shared libraries: libc.so.6: cannot open shared object file: No such file or directory ...
    (borland.public.delphi.non-technical)
  • Question about installation for DBI
    ... You can install them any time after installing the DBI. ... open shared object file: No such file or directory at ... FAILED tests 1, 4-51 ...
    (perl.dbi.users)